Target
Protein kinase C theta type
Ligand
BDBM50387345
Substrate
Meas. Tech.
ChEMBL_828096 (CHEMBL2049835)
Ki
38±n/a nM
Citation
 Jimenez, JMDavis, CBoyall, DFraysse, DKnegtel, RSettimo, LYoung, SBolton, CChiu, PCurnock, ARasmussen, RTanner, AAger, I Structure-based optimization of aminopyridines as PKC¿ inhibitors. Bioorg Med Chem Lett 22:4645-9 (2012)  
Target
Name:
Protein kinase C theta type
Synonyms:
KPCT_HUMAN PRKCT Protein kinase C theta type (PRKCQ) nPKC-theta
Type:
Serine/threonine-protein kinase
Mol. Mass.:
81878.04
Organism:
Homo sapiens (Human)
Description:
Full-length human PKC theta (Panvera Catalog No. P2996).
Residue:
706
  
Inhibitor
Name:
BDBM50387345
Synonyms:
CHEMBL2046639
Type:
Small organic molecule
Emp. Form.:
C19H25N5O
Mol. Mass.:
339.4347
SMILES:
CC(C)(C)[C@H]1CN(CCN1)c1cccc(n1)C(=O)c1cccnc1N
: