Target
Deoxyuridine 5'-triphosphate nucleotidohydrolase, mitochondrial
Ligand
BDBM101748
Substrate
Meas. Tech.
ChEMBL_828843 (CHEMBL2060493)
IC50
21±n/a nM
Citation
 Miyahara, SMiyakoshi, HYokogawa, TChong, KTTaguchi, JMuto, TEndoh, KYano, WWakasa, TUeno, HTakao, YFujioka, AHashimoto, AItou, KYamamura, KNomura, MNagasawa, HShuto, SFukuoka, M Discovery of a novel class of potent human deoxyuridine triphosphatase inhibitors remarkably enhancing the antitumor activity of thymidylate synthase inhibitors. J Med Chem 55:2970-80 (2012)  
Target
Name:
Deoxyuridine 5'-triphosphate nucleotidohydrolase, mitochondrial
Synonyms:
DUT Deoxyuridine 5'-triphosphate nucleotidohydrolase (dUTPase) dUTP pyrophosphatase
Type:
Enzyme
Mol. Mass.:
26574.03
Organism:
Homo sapiens (Human)
Description:
P33316
Residue:
252
  
Inhibitor
Name:
BDBM101748
Synonyms:
CHEMBL2057911 | US8530490, 8
Type:
Small organic molecule
Emp. Form.:
C20H26FN3O6S
Mol. Mass.:
455.5
SMILES:
C[C@@H](NS(=O)(=O)CCCOCn1ccc(=O)[nH]c1=O)c1ccc(F)c(OCC2CC2)c1
: