Target
Deoxyuridine 5'-triphosphate nucleotidohydrolase, mitochondrial
Ligand
BDBM50173539
Substrate
Meas. Tech.
ChEMBL_828843 (CHEMBL2060493)
Ki
18000±n/a nM
Citation
 Miyahara, SMiyakoshi, HYokogawa, TChong, KTTaguchi, JMuto, TEndoh, KYano, WWakasa, TUeno, HTakao, YFujioka, AHashimoto, AItou, KYamamura, KNomura, MNagasawa, HShuto, SFukuoka, M Discovery of a novel class of potent human deoxyuridine triphosphatase inhibitors remarkably enhancing the antitumor activity of thymidylate synthase inhibitors. J Med Chem 55:2970-80 (2012)  
Target
Name:
Deoxyuridine 5'-triphosphate nucleotidohydrolase, mitochondrial
Synonyms:
DUT Deoxyuridine 5'-triphosphate nucleotidohydrolase (dUTPase) dUTP pyrophosphatase
Type:
Enzyme
Mol. Mass.:
26574.03
Organism:
Homo sapiens (Human)
Description:
P33316
Residue:
252
  
Inhibitor
Name:
BDBM50173539
Synonyms:
1-(4-Hydroxy-5-trityloxymethyl-tetrahydro-furan-2-yl)-1H-pyrimidine-2,4-dione CHEMBL438428
Type:
Small organic molecule
Emp. Form.:
C28H26N2O5
Mol. Mass.:
470.5164
SMILES:
O[C@H]1C[C@@H](O[C@@H]1COC(c1ccccc1)(c1ccccc1)c1ccccc1)n1ccc(=O)[nH]c1=O
: