Target
Tyrosyl-DNA phosphodiesterase 1
Ligand
BDBM50388546
Substrate
Meas. Tech.
ChEMBL_830580 (CHEMBL2061435)
Ki
3190±n/a nM
Citation
 Nguyen, TXMorrell, AConda-Sheridan, MMarchand, CAgama, KBermingham, ABermingam, AStephen, AGChergui, ANaumova, AFisher, RO'Keefe, BRPommier, YCushman, M Synthesis and biological evaluation of the first dual tyrosyl-DNA phosphodiesterase I (Tdp1)-topoisomerase I (Top1) inhibitors. J Med Chem 55:4457-78 (2012)  
Target
Name:
Tyrosyl-DNA phosphodiesterase 1
Synonyms:
TDP1 Tyrosyl-DNA phosphodiesterase 1 | Tyrosyl-DNA phosphodiesterase 1 (TDP1)
Type:
Enzyme
Mol. Mass.:
68430.66
Organism:
Homo sapiens (Human)
Description:
Q9NUW8
Residue:
608
  
Inhibitor
Name:
BDBM50388546
Synonyms:
CHEMBL213072 | CHEMBL333363
Type:
Small organic molecule
Emp. Form.:
C19H16N2O2
Mol. Mass.:
304.3425
SMILES:
NCCCn1c2-c3ccccc3C(=O)c2c2ccccc2c1=O
: