Target
Macrophage colony-stimulating factor 1 receptor
Ligand
BDBM50388874
Substrate
Meas. Tech.
ChEMBL_830843 (CHEMBL2065349)
Ki
5±n/a nM
Citation
 Milletti, FHermann, JC Targeted kinase selectivity from kinase profiling data. ACS Med Chem Lett 3:383-386 (2012)  
Target
Name:
Macrophage colony-stimulating factor 1 receptor
Synonyms:
CSF1R FMS Macrophage colony stimulating factor receptor Macrophage colony-stimulating factor 1 receptor (c-FMS) Proto-oncogene c-Fms c-fms | cFMS
Type:
Protein
Mol. Mass.:
107979.48
Organism:
Homo sapiens (Human)
Description:
P07333
Residue:
972
  
Inhibitor
Name:
BDBM50388874
Synonyms:
CHEMBL1967720
Type:
Small organic molecule
Emp. Form.:
C27H24FN7O2S
Mol. Mass.:
529.589
SMILES:
CC(C)(C(N)=O)n1cc(cn1)-c1cnc(N)c2c(csc12)-c1ccc(NC(=O)Nc2cccc(F)c2)cc1
: