Target
Protein kinase C alpha type
Ligand
BDBM50389082
Substrate
Meas. Tech.
ChEMBL_833715 (CHEMBL2066814)
IC50
>100000±n/a nM
Citation
 Lo Monte, FKramer, TGu, JAnumala, URMarinelli, LLa Pietra, VNovellino, EFranco, BDemedts, DVan Leuven, FFuertes, ADominguez, JMPlotkin, BEldar-Finkelman, HSchmidt, B Identification of glycogen synthase kinase-3 inhibitors with a selective sting for glycogen synthase kinase-3a. J Med Chem 55:4407-24 (2012)  
Target
Name:
Protein kinase C alpha type
Synonyms:
KPCA_HUMAN PKC alpha and beta-2 PKC-alpha PRKACA Protein Kinase C- alpha Protein kinase C alpha (PKCa) Protein kinase C alpha type (PRKCA) RAF proto-oncogene serine/threonine-protein kinase
Type:
Enzyme
Mol. Mass.:
76755.65
Organism:
Homo sapiens (Human)
Description:
The recombinant human PKC enzymes were produced using a baculovirus expression system in SF9 cells
Residue:
672
  
Inhibitor
Name:
BDBM50389082
Synonyms:
CHEMBL2064536
Type:
Small organic molecule
Emp. Form.:
C21H14N4OS
Mol. Mass.:
370.427
SMILES:
N#Cc1ccccc1-c1ccc(CSc2nnc(o2)-c2ccncc2)cc1
: