Target
Glycogen synthase kinase-3 beta
Ligand
BDBM50389089
Substrate
Meas. Tech.
ChEMBL_833720 (CHEMBL2066819)
IC50
130±n/a nM
Citation
 Lo Monte, FKramer, TGu, JAnumala, URMarinelli, LLa Pietra, VNovellino, EFranco, BDemedts, DVan Leuven, FFuertes, ADominguez, JMPlotkin, BEldar-Finkelman, HSchmidt, B Identification of glycogen synthase kinase-3 inhibitors with a selective sting for glycogen synthase kinase-3a. J Med Chem 55:4407-24 (2012)  
Target
Name:
Glycogen synthase kinase-3 beta
Synonyms:
GSK-3 beta GSK3B Glycogen synthase kinase 3 beta (GSK3B) Glycogen synthase kinase-3 beta (GSK-3B) Glycogen synthase kinase-3 beta (GSK3B) Glycogen synthase kinase-3beta (GSK3B) | Serine/threonine-protein kinase GSK3B
Type:
Enzyme
Mol. Mass.:
46756.38
Organism:
Homo sapiens (Human)
Description:
P49841
Residue:
420
  
Inhibitor
Name:
BDBM50389089
Synonyms:
CHEMBL2064517
Type:
Small organic molecule
Emp. Form.:
C17H11N3O3S
Mol. Mass.:
337.353
SMILES:
N#Cc1ccc(CSc2nnc(o2)-c2ccc3OCOc3c2)cc1
: