Target
Glycogen synthase kinase-3 beta
Ligand
BDBM8552
Substrate
Meas. Tech.
ChEMBL_833720 (CHEMBL2066819)
IC50
790±n/a nM
Citation
 Lo Monte, FKramer, TGu, JAnumala, URMarinelli, LLa Pietra, VNovellino, EFranco, BDemedts, DVan Leuven, FFuertes, ADominguez, JMPlotkin, BEldar-Finkelman, HSchmidt, B Identification of glycogen synthase kinase-3 inhibitors with a selective sting for glycogen synthase kinase-3a. J Med Chem 55:4407-24 (2012)  
Target
Name:
Glycogen synthase kinase-3 beta
Synonyms:
GSK-3 beta GSK3B Glycogen synthase kinase 3 beta (GSK3B) Glycogen synthase kinase-3 beta (GSK-3B) Glycogen synthase kinase-3 beta (GSK3B) Glycogen synthase kinase-3beta (GSK3B) | Serine/threonine-protein kinase GSK3B
Type:
Enzyme
Mol. Mass.:
46756.38
Organism:
Homo sapiens (Human)
Description:
P49841
Residue:
420
  
Inhibitor
Name:
BDBM8552
Synonyms:
2-{[(3-iodophenyl)methyl]sulfanyl}-5-(pyridin-4-yl)-1,3,4-oxadiazole | oxadiazole-pyridyl containing compound 12
Type:
Small organic molecule
Emp. Form.:
C14H10IN3OS
Mol. Mass.:
395.218
SMILES:
Ic1cccc(CSc2nnc(o2)-c2ccncc2)c1
: