Target
Glycogen synthase kinase-3 alpha
Ligand
BDBM69279
Substrate
Meas. Tech.
ChEMBL_833721 (CHEMBL2066820)
IC50
7379±n/a nM
Citation
 Lo Monte, FKramer, TGu, JAnumala, URMarinelli, LLa Pietra, VNovellino, EFranco, BDemedts, DVan Leuven, FFuertes, ADominguez, JMPlotkin, BEldar-Finkelman, HSchmidt, B Identification of glycogen synthase kinase-3 inhibitors with a selective sting for glycogen synthase kinase-3a. J Med Chem 55:4407-24 (2012)  
Target
Name:
Glycogen synthase kinase-3 alpha
Synonyms:
GSK-3 alpha GSK3A_HUMAN Glycogen synthase kinase-3 Glycogen synthase kinase-3 alpha (GSK3 Alpha) Glycogen synthase kinase-3 alpha (GSK3alpha)
Type:
Enzyme
Mol. Mass.:
50991.79
Organism:
Homo sapiens (Human)
Description:
P49840
Residue:
483
  
Inhibitor
Name:
BDBM69279
Synonyms:
4-[(5-pyridin-4-yl-1,3,4-oxadiazol-2-yl)sulfanylmethyl]benzenecarbonitrile 4-[[(5-pyridin-4-yl-1,3,4-oxadiazol-2-yl)thio]methyl]benzonitrile MLS000687325 cid_1467927
Type:
Small organic molecule
Emp. Form.:
C15H10N4OS
Mol. Mass.:
294.331
SMILES:
N#Cc1ccc(CSc2nnc(o2)-c2ccncc2)cc1
: