Target
Glycogen synthase kinase-3 alpha
Ligand
BDBM50389079
Substrate
Meas. Tech.
ChEMBL_833721 (CHEMBL2066820)
IC50
2±n/a nM
Citation
 Lo Monte, FKramer, TGu, JAnumala, URMarinelli, LLa Pietra, VNovellino, EFranco, BDemedts, DVan Leuven, FFuertes, ADominguez, JMPlotkin, BEldar-Finkelman, HSchmidt, B Identification of glycogen synthase kinase-3 inhibitors with a selective sting for glycogen synthase kinase-3a. J Med Chem 55:4407-24 (2012)  
Target
Name:
Glycogen synthase kinase-3 alpha
Synonyms:
GSK-3 alpha GSK3A_HUMAN Glycogen synthase kinase-3 Glycogen synthase kinase-3 alpha (GSK3 Alpha) Glycogen synthase kinase-3 alpha (GSK3alpha)
Type:
Enzyme
Mol. Mass.:
50991.79
Organism:
Homo sapiens (Human)
Description:
P49840
Residue:
483
  
Inhibitor
Name:
BDBM50389079
Synonyms:
CHEMBL2064532
Type:
Small organic molecule
Emp. Form.:
C23H14FN3O3S
Mol. Mass.:
431.439
SMILES:
Fc1ccc(-c2ccc(CSc3nnc(o3)-c3ccc4OCOc4c3)cc2)c(c1)C#N
: