Target
72 kDa type IV collagenase
Ligand
BDBM50389095
Substrate
Meas. Tech.
ChEMBL_832930 (CHEMBL2066885)
IC50
107±n/a nM
Citation
 Hugenberg, VBreyholz, HJRiemann, BHermann, SSchober, OSchäfers, MGangadharmath, UMocharla, VKolb, HWalsh, JZhang, WKopka, KWagner, S A new class of highly potent matrix metalloproteinase inhibitors based on triazole-substituted hydroxamates: (radio)synthesis and in vitro and first in vivo evaluation. J Med Chem 55:4714-27 (2012)  
Target
Name:
72 kDa type IV collagenase
Synonyms:
72 kDa gelatinase CLG4A Gelatinase A (MMP-2) MMP2_HUMAN Matrix metalloproteinase-2 (MMP 2) Matrix metalloproteinases 2 (MMP-2) | TBE-1
Type:
Enzyme
Mol. Mass.:
73870.36
Organism:
Homo sapiens (Human)
Description:
P08253
Residue:
660
  
Inhibitor
Name:
BDBM50389095
Synonyms:
CHEMBL2064546
Type:
Small organic molecule
Emp. Form.:
C24H31N5O8S2
Mol. Mass.:
581.662
SMILES:
COc1ccc(cc1)S(=O)(=O)N(Cc1cn(CCOS(=O)(=O)c2ccc(C)cc2)nn1)[C@H](C(C)C)C(=O)NO
: