Target
Neutrophil collagenase
Ligand
BDBM50389095
Substrate
Meas. Tech.
ChEMBL_832926 (CHEMBL2066797)
IC50
8±n/a nM
Citation
 Hugenberg, VBreyholz, HJRiemann, BHermann, SSchober, OSchäfers, MGangadharmath, UMocharla, VKolb, HWalsh, JZhang, WKopka, KWagner, S A new class of highly potent matrix metalloproteinase inhibitors based on triazole-substituted hydroxamates: (radio)synthesis and in vitro and first in vivo evaluation. J Med Chem 55:4714-27 (2012)  
Target
Name:
Neutrophil collagenase
Synonyms:
CLG1 MMP8 Matrix metalloproteinase-8 PMNL collagenase | PMNL-CL
Type:
Enzyme
Mol. Mass.:
53413.48
Organism:
Homo sapiens (Human)
Description:
P22894
Residue:
467
  
Inhibitor
Name:
BDBM50389095
Synonyms:
CHEMBL2064546
Type:
Small organic molecule
Emp. Form.:
C24H31N5O8S2
Mol. Mass.:
581.662
SMILES:
COc1ccc(cc1)S(=O)(=O)N(Cc1cn(CCOS(=O)(=O)c2ccc(C)cc2)nn1)[C@H](C(C)C)C(=O)NO
: