Target
Collagenase 3
Ligand
BDBM50389095
Substrate
Meas. Tech.
ChEMBL_832928 (CHEMBL2066883)
IC50
5±n/a nM
Citation
 Hugenberg, VBreyholz, HJRiemann, BHermann, SSchober, OSchäfers, MGangadharmath, UMocharla, VKolb, HWalsh, JZhang, WKopka, KWagner, S A new class of highly potent matrix metalloproteinase inhibitors based on triazole-substituted hydroxamates: (radio)synthesis and in vitro and first in vivo evaluation. J Med Chem 55:4714-27 (2012)  
Target
Name:
Collagenase 3
Synonyms:
MMP-13 MMP13_HUMAN Matrix metalloproteinase-13 (MMP-13) | Matrix metalloproteinase-13 (MMP13)
Type:
Enzyme
Mol. Mass.:
53808.06
Organism:
Homo sapiens (Human)
Description:
P45452
Residue:
471
  
Inhibitor
Name:
BDBM50389095
Synonyms:
CHEMBL2064546
Type:
Small organic molecule
Emp. Form.:
C24H31N5O8S2
Mol. Mass.:
581.662
SMILES:
COc1ccc(cc1)S(=O)(=O)N(Cc1cn(CCOS(=O)(=O)c2ccc(C)cc2)nn1)[C@H](C(C)C)C(=O)NO
: