Target
Activated CDC42 kinase 1
Ligand
BDBM50389154
Substrate
Meas. Tech.
ChEMBL_833221 (CHEMBL2067585)
IC50
41±n/a nM
Citation
 Gingrich, DELisko, JGCurry, MACheng, MQuail, MLu, LWan, WAlbom, MSAngeles, TSAimone, LDHaltiwanger, RCWells-Knecht, KOtt, GRGhose, AKAtor, MARuggeri, BDorsey, BD Discovery of an orally efficacious inhibitor of anaplastic lymphoma kinase. J Med Chem 55:4580-93 (2012)  
Target
Name:
Activated CDC42 kinase 1
Synonyms:
ACK1 Activated CDC42 kinase 1 (ACK-1) Tyrosine kinase non-receptor protein 2
Type:
Protein
Mol. Mass.:
114577.86
Organism:
Homo sapiens (Human)
Description:
Q07912
Residue:
1038
  
Inhibitor
Name:
BDBM50389154
Synonyms:
CHEMBL2064666
Type:
Small organic molecule
Emp. Form.:
C28H35ClN6O3
Mol. Mass.:
539.069
SMILES:
COc1c(Nc2ncc(Cl)c(N[C@@H]3[C@@H]4C[C@@H](C=C4)[C@@H]3C(N)=O)n2)ccc2CC[C@@H](CCc12)N1CCOCC1
: