Target
Aurora kinase A
Ligand
BDBM50389240
Substrate
Meas. Tech.
ChEMBL_831557 (CHEMBL2064920)
IC50
3790±n/a nM
Citation
 Ji, ZDai, YAbad-Zapatero, CAlbert, DHBouska, JJGlaser, KBMarcotte, PASoni, NBMagoc, TJStewart, KDWei, RQDavidsen, SKMichaelides, MR Exploration of diverse hinge-binding scaffolds for selective Aurora kinase inhibitors. Bioorg Med Chem Lett 22:4528-31 (2012)  
Target
Name:
Aurora kinase A
Synonyms:
AIK ARK-1 AURA AURKA_HUMAN Aurora 2 Aurora kinase A (AURKA) Aurora kinase A (Aurora-2) Aurora/IPL1-related kinase 1 Breast tumor-amplified kinase IAK1 STK15 GN Serine/threonine kinase 15 Serine/threonine-protein kinase 6 Serine/threonine-protein kinase aurora-A aurora-2 | hARK1
Type:
Serine/threonine-protein kinase
Mol. Mass.:
45830.98
Organism:
Homo sapiens (Human)
Description:
O14965
Residue:
403
  
Inhibitor
Name:
BDBM50389240
Synonyms:
CHEMBL2063441
Type:
Small organic molecule
Emp. Form.:
C22H19N5O3
Mol. Mass.:
401.418
SMILES:
Nc1noc2cccc(C(=O)Nc3cccc(CNC(=O)Nc4ccccc4)c3)c12
: