Target
Beta-2 adrenergic receptor
Ligand
BDBM50389828
Substrate
Meas. Tech.
ChEMBL_834830 (CHEMBL2073147)
Ki
794±n/a nM
Citation
 Sanders, MPRoumen, Lvan der Horst, ELane, JRVischer, HFvan Offenbeek, Jde Vries, HVerhoeven, SChow, KYVerkaar, FBeukers, MWMcGuire, RLeurs, RIjzerman, APde Vlieg, Jde Esch, IJZaman, GJKlomp, JPBender, Ade Graaf, C A prospective cross-screening study on G-protein-coupled receptors: lessons learned in virtual compound library design. J Med Chem 55:5311-25 (2012)  
Target
Name:
Beta-2 adrenergic receptor
Synonyms:
ADRB2 ADRB2_HUMAN Beta-2 adrenoceptor | Beta-2 adrenoreceptor
Type:
Mol. Mass.:
46461.69
Organism:
Homo sapiens (Human)
Description:
P07550
Residue:
413
  
Inhibitor
Name:
BDBM50389828
Synonyms:
CHEMBL2070834
Type:
Small organic molecule
Emp. Form.:
C18H29NO2
Mol. Mass.:
291.4284
SMILES:
CC(C)c1ccc(C)cc1OCC(O)CN1CCCCC1
: