Target
Beta-2 adrenergic receptor
Ligand
BDBM50389824
Substrate
Meas. Tech.
ChEMBL_834830 (CHEMBL2073147)
Ki
25119±n/a nM
Citation
 Sanders, MPRoumen, Lvan der Horst, ELane, JRVischer, HFvan Offenbeek, Jde Vries, HVerhoeven, SChow, KYVerkaar, FBeukers, MWMcGuire, RLeurs, RIjzerman, APde Vlieg, Jde Esch, IJZaman, GJKlomp, JPBender, Ade Graaf, C A prospective cross-screening study on G-protein-coupled receptors: lessons learned in virtual compound library design. J Med Chem 55:5311-25 (2012)  
Target
Name:
Beta-2 adrenergic receptor
Synonyms:
ADRB2 ADRB2_HUMAN Beta-2 adrenoceptor | Beta-2 adrenoreceptor
Type:
Mol. Mass.:
46461.69
Organism:
Homo sapiens (Human)
Description:
P07550
Residue:
413
  
Inhibitor
Name:
BDBM50389824
Synonyms:
CHEMBL2070835
Type:
Small organic molecule
Emp. Form.:
C11H15N3O
Mol. Mass.:
205.2563
SMILES:
CN(C)Cc1c(O)ccc2nc(C)[nH]c12
: