Target
Beta-2 adrenergic receptor
Ligand
BDBM50389826
Substrate
Meas. Tech.
ChEMBL_834830 (CHEMBL2073147)
Ki
39811±n/a nM
Citation
 Sanders, MPRoumen, Lvan der Horst, ELane, JRVischer, HFvan Offenbeek, Jde Vries, HVerhoeven, SChow, KYVerkaar, FBeukers, MWMcGuire, RLeurs, RIjzerman, APde Vlieg, Jde Esch, IJZaman, GJKlomp, JPBender, Ade Graaf, C A prospective cross-screening study on G-protein-coupled receptors: lessons learned in virtual compound library design. J Med Chem 55:5311-25 (2012)  
Target
Name:
Beta-2 adrenergic receptor
Synonyms:
ADRB2 ADRB2_HUMAN Beta-2 adrenoceptor | Beta-2 adrenoreceptor
Type:
Mol. Mass.:
46461.69
Organism:
Homo sapiens (Human)
Description:
P07550
Residue:
413
  
Inhibitor
Name:
BDBM50389826
Synonyms:
CHEMBL1620339
Type:
Small organic molecule
Emp. Form.:
C19H32N2O3
Mol. Mass.:
336.469
SMILES:
CC(C)c1ccc(C)cc1OCC(O)CN1CCN(CCO)CC1
: