Target
Adenosine receptor A2a
Ligand
BDBM50389832
Substrate
Meas. Tech.
ChEMBL_834829 (CHEMBL2073146)
Ki
2512±n/a nM
Citation
 Sanders, MPRoumen, Lvan der Horst, ELane, JRVischer, HFvan Offenbeek, Jde Vries, HVerhoeven, SChow, KYVerkaar, FBeukers, MWMcGuire, RLeurs, RIjzerman, APde Vlieg, Jde Esch, IJZaman, GJKlomp, JPBender, Ade Graaf, C A prospective cross-screening study on G-protein-coupled receptors: lessons learned in virtual compound library design. J Med Chem 55:5311-25 (2012)  
Target
Name:
Adenosine receptor A2a
Synonyms:
A2A adenosine receptor (hA2A) ADENOSINE A2 ADORA2 Adenosine A2A receptor (A2AAR)
Type:
G Protein-Coupled Receptor (GPCR)
Mol. Mass.:
44716.46
Organism:
Homo sapiens (Human)
Description:
P29274
Residue:
412
  
Inhibitor
Name:
BDBM50389832
Synonyms:
CHEMBL2070726
Type:
Small organic molecule
Emp. Form.:
C22H21N5O2
Mol. Mass.:
387.4344
SMILES:
CC1CCN(CC1)C(=O)c1ccc2c(c1)n1nnc(-c3ccccc3)c1[nH]c2=O
: