Target
Adenosine receptor A2a
Ligand
BDBM50389835
Substrate
Meas. Tech.
ChEMBL_834829 (CHEMBL2073146)
Ki
3981±n/a nM
Citation
 Sanders, MPRoumen, Lvan der Horst, ELane, JRVischer, HFvan Offenbeek, Jde Vries, HVerhoeven, SChow, KYVerkaar, FBeukers, MWMcGuire, RLeurs, RIjzerman, APde Vlieg, Jde Esch, IJZaman, GJKlomp, JPBender, Ade Graaf, C A prospective cross-screening study on G-protein-coupled receptors: lessons learned in virtual compound library design. J Med Chem 55:5311-25 (2012)  
Target
Name:
Adenosine receptor A2a
Synonyms:
A2A adenosine receptor (hA2A) ADENOSINE A2 ADORA2 Adenosine A2A receptor (A2AAR)
Type:
G Protein-Coupled Receptor (GPCR)
Mol. Mass.:
44716.46
Organism:
Homo sapiens (Human)
Description:
P29274
Residue:
412
  
Inhibitor
Name:
BDBM50389835
Synonyms:
CHEMBL2070724
Type:
Small organic molecule
Emp. Form.:
C16H14N6OS2
Mol. Mass.:
370.452
SMILES:
Cc1cnc(NC(=O)CSc2nnc3c(n2)[nH]c2ccc(C)cc32)s1
: