Target
Adenosine receptor A2a
Ligand
BDBM50389836
Substrate
Meas. Tech.
ChEMBL_834829 (CHEMBL2073146)
Ki
5012±n/a nM
Citation
 Sanders, MPRoumen, Lvan der Horst, ELane, JRVischer, HFvan Offenbeek, Jde Vries, HVerhoeven, SChow, KYVerkaar, FBeukers, MWMcGuire, RLeurs, RIjzerman, APde Vlieg, Jde Esch, IJZaman, GJKlomp, JPBender, Ade Graaf, C A prospective cross-screening study on G-protein-coupled receptors: lessons learned in virtual compound library design. J Med Chem 55:5311-25 (2012)  
Target
Name:
Adenosine receptor A2a
Synonyms:
A2A adenosine receptor (hA2A) ADENOSINE A2 ADORA2 Adenosine A2A receptor (A2AAR)
Type:
G Protein-Coupled Receptor (GPCR)
Mol. Mass.:
44716.46
Organism:
Homo sapiens (Human)
Description:
P29274
Residue:
412
  
Inhibitor
Name:
BDBM50389836
Synonyms:
CHEMBL2070722
Type:
Small organic molecule
Emp. Form.:
C18H19N5O3S
Mol. Mass.:
385.44
SMILES:
NC(Nc1nc2ccccc2s1)=NC(=O)CN1C(=O)C2CCCCC2C1=O
: