Target
Adenosine receptor A2a
Ligand
BDBM50389842
Substrate
Meas. Tech.
ChEMBL_834829 (CHEMBL2073146)
Ki
6310±n/a nM
Citation
 Sanders, MPRoumen, Lvan der Horst, ELane, JRVischer, HFvan Offenbeek, Jde Vries, HVerhoeven, SChow, KYVerkaar, FBeukers, MWMcGuire, RLeurs, RIjzerman, APde Vlieg, Jde Esch, IJZaman, GJKlomp, JPBender, Ade Graaf, C A prospective cross-screening study on G-protein-coupled receptors: lessons learned in virtual compound library design. J Med Chem 55:5311-25 (2012)  
Target
Name:
Adenosine receptor A2a
Synonyms:
A2A adenosine receptor (hA2A) ADENOSINE A2 ADORA2 Adenosine A2A receptor (A2AAR)
Type:
G Protein-Coupled Receptor (GPCR)
Mol. Mass.:
44716.46
Organism:
Homo sapiens (Human)
Description:
P29274
Residue:
412
  
Inhibitor
Name:
BDBM50389842
Synonyms:
CHEMBL2070723
Type:
Small organic molecule
Emp. Form.:
C21H17N5O3S2
Mol. Mass.:
451.521
SMILES:
CC1=C(C(C(C#N)C(SCC(N)=O)=N1)c1ccco1)C(=O)Nc1nc2ccccc2s1
: