Target
Microtubule-associated protein tau
Ligand
BDBM50390102
Substrate
Meas. Tech.
ChEMBL_834363 (CHEMBL2073279)
Ki
17±n/a nM
Citation
 Watanabe, HOno, MKimura, HMatsumura, KYoshimura, MOkamoto, YIhara, MTakahashi, RSaji, H Synthesis and biological evaluation of novel oxindole derivatives for imaging neurofibrillary tangles in Alzheimer's disease. Bioorg Med Chem Lett 22:5700-3 (2012)  
Target
Name:
Microtubule-associated protein tau
Synonyms:
MAPT MTBT1 Neurofibrillary tangle protein Paired helical filament-tau TAU_HUMAN | Tau Protein
Type:
Protein
Mol. Mass.:
78928.63
Organism:
Homo sapiens (Human)
Description:
P10636
Residue:
758
  
Inhibitor
Name:
BDBM50390102
Synonyms:
CHEMBL2069433
Type:
Small organic molecule
Emp. Form.:
C17H15IN2O
Mol. Mass.:
390.2183
SMILES:
CN(C)c1ccc(\C=C2/Nc3ccc(I)cc3C2=O)cc1
: