Target
Proto-oncogene tyrosine-protein kinase Src
Ligand
BDBM50343421
Substrate
Meas. Tech.
ChEMBL_834781 (CHEMBL2073049)
Ki
2400±n/a nM
Citation
 Radi, MEvensen, LDreassi, EZamperini, CCaporicci, MFalchi, FMusumeci, FSchenone, SLorens, JBBotta, M A combined targeted/phenotypic approach for the identification of new antiangiogenics agents active on a zebrafish model: from in silico screening to cyclodextrin formulation. Bioorg Med Chem Lett 22:5579-83 (2012)  
Target
Name:
Proto-oncogene tyrosine-protein kinase Src
Synonyms:
Calmodulin/Proto-oncogene tyrosine-protein kinase Src Proto-oncogene c-Src SRC SRC_HUMAN V-src sarcoma (Schmidt-Ruppin A-2) viral oncogene homolog (avian) p60-Src | pp60c-src
Type:
Protein
Mol. Mass.:
59838.60
Organism:
Homo sapiens (Human)
Description:
P12931
Residue:
536
  
Inhibitor
Name:
BDBM50343421
Synonyms:
2-({4-[(2-Phenylethyl)amino]-1-(2-phenylvinyl)-1H-pyrazolo[3,4-d]pyrimidin-6-yl}-amino)ethanol | CHEMBL1775042
Type:
Small organic molecule
Emp. Form.:
C23H24N6O
Mol. Mass.:
400.4763
SMILES:
OCCNc1nc(NCCc2ccccc2)c2cnn(\C=C/c3ccccc3)c2n1
: