Target
Tyrosine-protein kinase ABL1
Ligand
BDBM50343429
Substrate
Meas. Tech.
ChEMBL_834782 (CHEMBL2073050)
Ki
270±n/a nM
Citation
 Radi, MEvensen, LDreassi, EZamperini, CCaporicci, MFalchi, FMusumeci, FSchenone, SLorens, JBBotta, M A combined targeted/phenotypic approach for the identification of new antiangiogenics agents active on a zebrafish model: from in silico screening to cyclodextrin formulation. Bioorg Med Chem Lett 22:5579-83 (2012)  
Target
Name:
Tyrosine-protein kinase ABL1
Synonyms:
ABL ABL1_HUMAN JTK7 Proto-oncogene tyrosine-protein kinase ABL1 Tyrosine-protein kinase ABL V-abl Abelson murine leukemia viral oncogene homolog 1 p150 | tyrosine-protein kinase ABL1 isoform a
Type:
Enzyme
Mol. Mass.:
122897.30
Organism:
Homo sapiens (Human)
Description:
P00519
Residue:
1130
  
Inhibitor
Name:
BDBM50343429
Synonyms:
1-(2-Chloro-2-phenylethyl)-6-[(2-morpholin-4-ylethyl)thio]-N-(2-phenylethyl)-1H-pyrazolo[3,4-d]pyrimidin-4-amine | CHEMBL1775037
Type:
Small organic molecule
Emp. Form.:
C27H31ClN6OS
Mol. Mass.:
523.093
SMILES:
ClC(Cn1ncc2c(NCCc3ccccc3)nc(SCCN3CCOCC3)nc12)c1ccccc1
: