Target
Tyrosine-protein kinase ABL1
Ligand
BDBM50343421
Substrate
Meas. Tech.
ChEMBL_834782 (CHEMBL2073050)
Ki
220±n/a nM
Citation
 Radi, MEvensen, LDreassi, EZamperini, CCaporicci, MFalchi, FMusumeci, FSchenone, SLorens, JBBotta, M A combined targeted/phenotypic approach for the identification of new antiangiogenics agents active on a zebrafish model: from in silico screening to cyclodextrin formulation. Bioorg Med Chem Lett 22:5579-83 (2012)  
Target
Name:
Tyrosine-protein kinase ABL1
Synonyms:
ABL ABL1_HUMAN JTK7 Proto-oncogene tyrosine-protein kinase ABL1 Tyrosine-protein kinase ABL V-abl Abelson murine leukemia viral oncogene homolog 1 p150 | tyrosine-protein kinase ABL1 isoform a
Type:
Enzyme
Mol. Mass.:
122897.30
Organism:
Homo sapiens (Human)
Description:
P00519
Residue:
1130
  
Inhibitor
Name:
BDBM50343421
Synonyms:
2-({4-[(2-Phenylethyl)amino]-1-(2-phenylvinyl)-1H-pyrazolo[3,4-d]pyrimidin-6-yl}-amino)ethanol | CHEMBL1775042
Type:
Small organic molecule
Emp. Form.:
C23H24N6O
Mol. Mass.:
400.4763
SMILES:
OCCNc1nc(NCCc2ccccc2)c2cnn(\C=C/c3ccccc3)c2n1
: