Target
Proto-oncogene tyrosine-protein kinase Src
Ligand
BDBM50343430
Substrate
Meas. Tech.
ChEMBL_834781 (CHEMBL2073049)
Ki
190±n/a nM
Citation
 Radi, MEvensen, LDreassi, EZamperini, CCaporicci, MFalchi, FMusumeci, FSchenone, SLorens, JBBotta, M A combined targeted/phenotypic approach for the identification of new antiangiogenics agents active on a zebrafish model: from in silico screening to cyclodextrin formulation. Bioorg Med Chem Lett 22:5579-83 (2012)  
Target
Name:
Proto-oncogene tyrosine-protein kinase Src
Synonyms:
Calmodulin/Proto-oncogene tyrosine-protein kinase Src Proto-oncogene c-Src SRC SRC_HUMAN V-src sarcoma (Schmidt-Ruppin A-2) viral oncogene homolog (avian) p60-Src | pp60c-src
Type:
Protein
Mol. Mass.:
59838.60
Organism:
Homo sapiens (Human)
Description:
P12931
Residue:
536
  
Inhibitor
Name:
BDBM50343430
Synonyms:
CHEMBL1775036 | N-(3-Chlorophenyl)-1-(2-chloro-2-phenylethyl)-6-[(2-morpholin-4-ylethyl)thio]-1H-pyrazolo[3,4-d]pyrimidin-4-amine
Type:
Small organic molecule
Emp. Form.:
C25H26Cl2N6OS
Mol. Mass.:
529.485
SMILES:
ClC(Cn1ncc2c(Nc3cccc(Cl)c3)nc(SCCN3CCOCC3)nc12)c1ccccc1
: