Target
Proto-oncogene tyrosine-protein kinase Src
Ligand
BDBM50343426
Substrate
Meas. Tech.
ChEMBL_834781 (CHEMBL2073049)
Ki
3800±n/a nM
Citation
 Radi, MEvensen, LDreassi, EZamperini, CCaporicci, MFalchi, FMusumeci, FSchenone, SLorens, JBBotta, M A combined targeted/phenotypic approach for the identification of new antiangiogenics agents active on a zebrafish model: from in silico screening to cyclodextrin formulation. Bioorg Med Chem Lett 22:5579-83 (2012)  
Target
Name:
Proto-oncogene tyrosine-protein kinase Src
Synonyms:
Calmodulin/Proto-oncogene tyrosine-protein kinase Src Proto-oncogene c-Src SRC SRC_HUMAN V-src sarcoma (Schmidt-Ruppin A-2) viral oncogene homolog (avian) p60-Src | pp60c-src
Type:
Protein
Mol. Mass.:
59838.60
Organism:
Homo sapiens (Human)
Description:
P12931
Residue:
536
  
Inhibitor
Name:
BDBM50343426
Synonyms:
1-(2-Chloro-2-phenylethyl)-6-[(2-morpholin-4-ylethyl)thio]-N-propyl-1H-pyrazolo[3,4-d]pyrimidin-4-amine | CHEMBL1775040
Type:
Small organic molecule
Emp. Form.:
C22H29ClN6OS
Mol. Mass.:
461.023
SMILES:
CCCNc1nc(SCCN2CCOCC2)nc2n(CC(Cl)c3ccccc3)ncc12
: