Target
Proto-oncogene tyrosine-protein kinase Src
Ligand
BDBM50354486
Substrate
Meas. Tech.
ChEMBL_834781 (CHEMBL2073049)
Ki
3000±n/a nM
Citation
 Radi, MEvensen, LDreassi, EZamperini, CCaporicci, MFalchi, FMusumeci, FSchenone, SLorens, JBBotta, M A combined targeted/phenotypic approach for the identification of new antiangiogenics agents active on a zebrafish model: from in silico screening to cyclodextrin formulation. Bioorg Med Chem Lett 22:5579-83 (2012)  
Target
Name:
Proto-oncogene tyrosine-protein kinase Src
Synonyms:
Calmodulin/Proto-oncogene tyrosine-protein kinase Src Proto-oncogene c-Src SRC SRC_HUMAN V-src sarcoma (Schmidt-Ruppin A-2) viral oncogene homolog (avian) p60-Src | pp60c-src
Type:
Protein
Mol. Mass.:
59838.60
Organism:
Homo sapiens (Human)
Description:
P12931
Residue:
536
  
Inhibitor
Name:
BDBM50354486
Synonyms:
CHEMBL411043
Type:
Small organic molecule
Emp. Form.:
C20H18ClN5
Mol. Mass.:
363.843
SMILES:
ClC(Cn1ncc2c(NCc3ccccc3)ncnc12)c1ccccc1
: