Target
ATP-dependent translocase ABCB1
Ligand
BDBM50344942
Substrate
Meas. Tech.
ChEMBL_838282 (CHEMBL2076230)
Ki
>1000000±n/a nM
Citation
 Ekins, SKim, RBLeake, BFDantzig, AHSchuetz, EGLan, LBYasuda, KShepard, RLWinter, MASchuetz, JDWikel, JHWrighton, SA Three-dimensional quantitative structure-activity relationships of inhibitors of P-glycoprotein. Mol Pharmacol 61:964-73 (2002)  
Target
Name:
ATP-dependent translocase ABCB1
Synonyms:
ABCB1 MDR1_HUMAN Multidrug resistance protein 1 P-glycoprotein (P-gp) PGY1
Type:
Protein
Mol. Mass.:
141503.50
Organism:
Homo sapiens (Human)
Description:
P08183
Residue:
1280
  
Inhibitor
Name:
BDBM50344942
Synonyms:
CHEMBL532 ERYTHROMYCIN Erycette Erythromycin A Ilotycin | T-Stat
Type:
Small organic molecule
Emp. Form.:
C37H67NO13
Mol. Mass.:
733.9268
SMILES:
CC[C@H]1OC(=O)[C@H](C)[C@@H](O[C@H]2C[C@@](C)(OC)[C@@H](O)[C@H](C)O2)[C@H](C)[C@@H](O[C@@H]2O[C@H](C)C[C@@H]([C@H]2O)N(C)C)[C@](C)(O)C[C@@H](C)C(=O)[C@H](C)[C@@H](O)[C@]1(C)O
: