Target
Deoxyuridine 5'-triphosphate nucleotidohydrolase, mitochondrial
Ligand
BDBM50391347
Substrate
Meas. Tech.
ChEMBL_847915 (CHEMBL2150114)
IC50
31±n/a nM
Citation
 Miyahara, SMiyakoshi, HYokogawa, TChong, KTTaguchi, JMuto, TEndoh, KYano, WWakasa, TUeno, HTakao, YFujioka, AHashimoto, AItou, KYamamura, KNomura, MNagasawa, HShuto, SFukuoka, M Discovery of highly potent human deoxyuridine triphosphatase inhibitors based on the conformation restriction strategy. J Med Chem 55:5483-96 (2012)  
Target
Name:
Deoxyuridine 5'-triphosphate nucleotidohydrolase, mitochondrial
Synonyms:
DUT Deoxyuridine 5'-triphosphate nucleotidohydrolase (dUTPase) dUTP pyrophosphatase
Type:
Enzyme
Mol. Mass.:
26574.03
Organism:
Homo sapiens (Human)
Description:
P33316
Residue:
252
  
Inhibitor
Name:
BDBM50391347
Synonyms:
CHEMBL2147976
Type:
Small organic molecule
Emp. Form.:
C25H29N3O5S
Mol. Mass.:
483.58
SMILES:
CC(C)(NS(=O)(=O)c1cccc(OC2CCCC2)c1)c1ccc(Cn2ccc(=O)[nH]c2=O)cc1
: