Target
Deoxyuridine 5'-triphosphate nucleotidohydrolase, mitochondrial
Ligand
BDBM50391349
Substrate
Meas. Tech.
ChEMBL_847915 (CHEMBL2150114)
IC50
340±n/a nM
Citation
 Miyahara, SMiyakoshi, HYokogawa, TChong, KTTaguchi, JMuto, TEndoh, KYano, WWakasa, TUeno, HTakao, YFujioka, AHashimoto, AItou, KYamamura, KNomura, MNagasawa, HShuto, SFukuoka, M Discovery of highly potent human deoxyuridine triphosphatase inhibitors based on the conformation restriction strategy. J Med Chem 55:5483-96 (2012)  
Target
Name:
Deoxyuridine 5'-triphosphate nucleotidohydrolase, mitochondrial
Synonyms:
DUT Deoxyuridine 5'-triphosphate nucleotidohydrolase (dUTPase) dUTP pyrophosphatase
Type:
Enzyme
Mol. Mass.:
26574.03
Organism:
Homo sapiens (Human)
Description:
P33316
Residue:
252
  
Inhibitor
Name:
BDBM50391349
Synonyms:
CHEMBL2147978
Type:
Small organic molecule
Emp. Form.:
C19H25N3O5S
Mol. Mass.:
407.484
SMILES:
COc1cccc(c1)S(=O)(=O)NC(C)(C)CC\C=C\Cn1ccc(=O)[nH]c1=O
: