Target
Deoxyuridine 5'-triphosphate nucleotidohydrolase, mitochondrial
Ligand
BDBM50391352
Substrate
Meas. Tech.
ChEMBL_847915 (CHEMBL2150114)
IC50
26±n/a nM
Citation
 Miyahara, SMiyakoshi, HYokogawa, TChong, KTTaguchi, JMuto, TEndoh, KYano, WWakasa, TUeno, HTakao, YFujioka, AHashimoto, AItou, KYamamura, KNomura, MNagasawa, HShuto, SFukuoka, M Discovery of highly potent human deoxyuridine triphosphatase inhibitors based on the conformation restriction strategy. J Med Chem 55:5483-96 (2012)  
Target
Name:
Deoxyuridine 5'-triphosphate nucleotidohydrolase, mitochondrial
Synonyms:
DUT Deoxyuridine 5'-triphosphate nucleotidohydrolase (dUTPase) dUTP pyrophosphatase
Type:
Enzyme
Mol. Mass.:
26574.03
Organism:
Homo sapiens (Human)
Description:
P33316
Residue:
252
  
Inhibitor
Name:
BDBM50391352
Synonyms:
CHEMBL2147981
Type:
Small organic molecule
Emp. Form.:
C20H25F2N3O5S
Mol. Mass.:
457.491
SMILES:
CC(C)(CC\C=C\Cn1ccc(=O)[nH]c1=O)NS(=O)(=O)c1cccc(OCC(F)F)c1
: