Target
Deoxyuridine 5'-triphosphate nucleotidohydrolase, mitochondrial
Ligand
BDBM50391355
Substrate
Meas. Tech.
ChEMBL_847915 (CHEMBL2150114)
IC50
410±n/a nM
Citation
 Miyahara, SMiyakoshi, HYokogawa, TChong, KTTaguchi, JMuto, TEndoh, KYano, WWakasa, TUeno, HTakao, YFujioka, AHashimoto, AItou, KYamamura, KNomura, MNagasawa, HShuto, SFukuoka, M Discovery of highly potent human deoxyuridine triphosphatase inhibitors based on the conformation restriction strategy. J Med Chem 55:5483-96 (2012)  
Target
Name:
Deoxyuridine 5'-triphosphate nucleotidohydrolase, mitochondrial
Synonyms:
DUT Deoxyuridine 5'-triphosphate nucleotidohydrolase (dUTPase) dUTP pyrophosphatase
Type:
Enzyme
Mol. Mass.:
26574.03
Organism:
Homo sapiens (Human)
Description:
P33316
Residue:
252
  
Inhibitor
Name:
BDBM50391355
Synonyms:
CHEMBL2147984
Type:
Small organic molecule
Emp. Form.:
C21H21F2N3O5S
Mol. Mass.:
465.47
SMILES:
C[C@@H](NS(=O)(=O)c1ccc(Cn2ccc(=O)[nH]c2=O)cc1)c1cccc(OCC(F)F)c1
: