Target
Deoxyuridine 5'-triphosphate nucleotidohydrolase, mitochondrial
Ligand
BDBM101847
Substrate
Meas. Tech.
ChEMBL_847915 (CHEMBL2150114)
IC50
39±n/a nM
Citation
 Miyahara, SMiyakoshi, HYokogawa, TChong, KTTaguchi, JMuto, TEndoh, KYano, WWakasa, TUeno, HTakao, YFujioka, AHashimoto, AItou, KYamamura, KNomura, MNagasawa, HShuto, SFukuoka, M Discovery of highly potent human deoxyuridine triphosphatase inhibitors based on the conformation restriction strategy. J Med Chem 55:5483-96 (2012)  
Target
Name:
Deoxyuridine 5'-triphosphate nucleotidohydrolase, mitochondrial
Synonyms:
DUT Deoxyuridine 5'-triphosphate nucleotidohydrolase (dUTPase) dUTP pyrophosphatase
Type:
Enzyme
Mol. Mass.:
26574.03
Organism:
Homo sapiens (Human)
Description:
P33316
Residue:
252
  
Inhibitor
Name:
BDBM101847
Synonyms:
CHEMBL2147985 | US8530490, 110
Type:
Small organic molecule
Emp. Form.:
C21H27N3O5S
Mol. Mass.:
433.521
SMILES:
C[C@@H](NS(=O)(=O)CC\C=C\Cn1ccc(=O)[nH]c1=O)c1cccc(OCC2CC2)c1
: