Target
High affinity nerve growth factor receptor
Ligand
BDBM50391953
Substrate
Meas. Tech.
ChEMBL_850958 (CHEMBL2157053)
IC50
1.67±n/a nM
Citation
 Hong, SKim, JSeo, JHJung, KHHong, SSHong, S Design, synthesis, and evaluation of 3,5-disubstituted 7-azaindoles as Trk inhibitors with anticancer and antiangiogenic activities. J Med Chem 55:5337-49 (2012)  
Target
Name:
High affinity nerve growth factor receptor
Synonyms:
2.7.10.1 NTRK1 NTRK1_HUMAN Neurotrophic tyrosine kinase receptor type 1 Synonyms=MTC TRK1-transforming tyrosine kinase protein TRKA GN Trk-A Tropomyosin-related kinase A Tyrosine kinase receptor Tyrosine kinase receptor A Tyrosine kinase receptor A (Trk-A) gp140trk | p140-TrkA
Type:
Mol. Mass.:
87498.18
Organism:
Homo sapiens (Human)
Description:
P04629
Residue:
796
  
Inhibitor
Name:
BDBM50391953
Synonyms:
CHEMBL2152288
Type:
Small organic molecule
Emp. Form.:
C25H18F3N5O2S
Mol. Mass.:
509.503
SMILES:
Nc1cc(NS(=O)(=O)c2cccc(c2)C(F)(F)F)cc(c1)-c1cnc2[nH]cc(-c3ccncc3)c2c1
: