Target
Tissue-type plasminogen activator
Ligand
BDBM50392589
Substrate
Meas. Tech.
ChEMBL_854020 (CHEMBL2155317)
Ki
>20000±n/a nM
Citation
 Pandya, VJain, MChakrabarti, GSoni, HParmar, BChaugule, BPatel, JJarag, TJoshi, JJoshi, NRath, AUnadkat, VSharma, BAjani, HKumar, JSairam, KVPatel, HPatel, P Synthesis and structure-activity relationship of potent, selective and orally active anthranilamide-based factor Xa inhibitors: application of weakly basic sulfoximine group as novel S4 binding element. Eur J Med Chem 58:136-52 (2012)  
Target
Name:
Tissue-type plasminogen activator
Synonyms:
Alteplase Reteplase Thrombin receptor protein Tissue-type plasminogen activator (tPA) t-PA t-plasminogen activator
Type:
Enzyme
Mol. Mass.:
62931.08
Organism:
Homo sapiens (Human)
Description:
Residue:
562
  
Inhibitor
Name:
BDBM50392589
Synonyms:
CHEMBL2153377
Type:
Small organic molecule
Emp. Form.:
C24H21Cl2N5O4S
Mol. Mass.:
546.426
SMILES:
CCN=CC(=O)N=S(C)(=O)c1ccc(cc1)C(=O)Nc1ccc(Cl)cc1C(=O)Nc1ccc(Cl)cn1
: