Target
Methionine synthase
Ligand
BDBM50392654
Substrate
Meas. Tech.
ChEMBL_854111 (CHEMBL2153942)
IC50
>100000±n/a nM
Citation
 Zhang, ZTian, CZhou, SWang, WGuo, YXia, JLiu, ZWang, BWang, XGolding, BTGriff, RJDu, YLiu, J Mechanism-based design, synthesis and biological studies of N5-substituted tetrahydrofolate analogs as inhibitors of cobalamin-dependent methionine synthase and potential anticancer agents. Eur J Med Chem 58:228-36 (2012)  
Target
Name:
Methionine synthase
Synonyms:
5-methyltetrahydrofolate--homocysteine methyltransferase MS Vitamin-B12 dependent methionine synthase
Type:
PROTEIN
Mol. Mass.:
140503.96
Organism:
Homo sapiens (Human)
Description:
ChEMBL_854111
Residue:
1265
  
Inhibitor
Name:
BDBM50392654
Synonyms:
CHEMBL2153709
Type:
Small organic molecule
Emp. Form.:
C21H27N7O5
Mol. Mass.:
457.483
SMILES:
CN(CC1CCc2nc(N)nc(N)c2N1)c1ccc(cc1)C(=O)N[C@@H](CCC(O)=O)C(O)=O
: