Target
Adenosine receptor A3
Ligand
BDBM50392827
Substrate
Meas. Tech.
ChEMBL_853298 (CHEMBL2155058)
Ki
5900±n/a nM
Citation
 Carlsson, JTosh, DKPhan, KGao, ZGJacobson, KA Structure-activity relationships and molecular modeling of 1,2,4-triazoles as adenosine receptor antagonists. ACS Med Chem Lett 3:715-720 (2012)  
Target
Name:
Adenosine receptor A3
Synonyms:
A3 adenosine receptor (hA3) ADORA3 | Adenosine A3 receptor (A3AR)
Type:
G Protein-Coupled Receptor (GPCR)
Mol. Mass.:
36197.32
Organism:
Homo sapiens (Human)
Description:
P0DMS8
Residue:
318
  
Inhibitor
Name:
BDBM50392827
Synonyms:
CHEMBL2151120
Type:
Small organic molecule
Emp. Form.:
C18H18N4O2
Mol. Mass.:
322.3611
SMILES:
CC(Oc1ccccc1)C(=O)Nc1nnc([nH]1)-c1cccc(C)c1
: