Target
Prostaglandin G/H synthase 2
Ligand
BDBM50295285
Substrate
Meas. Tech.
ChEMBL_853433 (CHEMBL2155291)
IC50
5500±n/a nM
Citation
 Windsor, MAHermanson, DJKingsley, PJXu, SCrews, BCHo, WKeenan, CMBanerjee, SSharkey, KAMarnett, LJ Substrate-Selective Inhibition of Cyclooxygenase-2: Development and Evaluation of Achiral Profen Probes. ACS Med Chem Lett 3:759-763 (2012)  
Target
Name:
Prostaglandin G/H synthase 2
Synonyms:
Cox-2 Cyclooxygenase-2 Glucocorticoid-regulated inflammatory cyclooxygenase Macrophage activation-associated marker protein P71/73 PGH synthase 2 PGHS-2 Pghs-b Prostaglandin H2 synthase 2 Ptgs2 Tis10
Type:
Protein
Mol. Mass.:
69020.39
Organism:
Mus musculus (Mouse)
Description:
Q05769
Residue:
604
  
Inhibitor
Name:
BDBM50295285
Synonyms:
(4-Isobutyl-phenyl)-acetic acid CHEMBL341812 | Ibufenac
Type:
Small organic molecule
Emp. Form.:
C12H16O2
Mol. Mass.:
192.2542
SMILES:
CC(C)Cc1ccc(CC(O)=O)cc1
: