Target
Acyl-CoA 6-desaturase
Ligand
BDBM50393166
Substrate
Meas. Tech.
ChEMBL_852951 (CHEMBL2154135)
IC50
>100000000±n/a nM
Citation
 Oballa, RMBelair, LBlack, WCBleasby, KChan, CCDesroches, CDu, XGordon, RGuay, JGuiral, SHafey, MJHamelin, EHuang, ZKennedy, BLachance, NLandry, FLi, CSMancini, JNormandin, DPocai, APowell, DARamtohul, YKSkorey, KSørensen, DSturkenboom, WStyhler, AWaddleton, DMWang, HWong, SXu, LZhang, L Development of a liver-targeted stearoyl-CoA desaturase (SCD) inhibitor (MK-8245) to establish a therapeutic window for the treatment of diabetes and dyslipidemia. J Med Chem 54:5082-96 (2011)  
Target
Name:
Acyl-CoA 6-desaturase
Synonyms:
FADS2 Fatty acid desaturase 2
Type:
PROTEIN
Mol. Mass.:
52278.85
Organism:
Homo sapiens (Human)
Description:
ChEMBL_852951
Residue:
444
  
Inhibitor
Name:
BDBM50393166
Synonyms:
CHEMBL2153601
Type:
Small organic molecule
Emp. Form.:
C16H15BrFN7O3S
Mol. Mass.:
484.303
SMILES:
OC(=O)Cn1nnc(n1)-c1nnc(s1)N1CCC(CC1)Oc1cc(F)ccc1Br
: