Target
Cytochrome P450 3A4
Ligand
BDBM50393265
Substrate
Meas. Tech.
ChEMBL_851741 (CHEMBL2156083)
Ki
540±n/a nM
Citation
 Dahal, UPJoswig-Jones, CJones, JP Comparative study of the affinity and metabolism of type I and type II binding quinoline carboxamide analogues by cytochrome P450 3A4. J Med Chem 55:280-90 (2012)  
Target
Name:
Cytochrome P450 3A4
Synonyms:
Albendazole monooxygenase CP3A4_HUMAN CYP3A4 CYPIIIA4 Cytochrome P450 3A4 (CYP3A4) Nifedipine oxidase Taurochenodeoxycholate 6-alpha-hydroxylase
Type:
Enzyme
Mol. Mass.:
57349.57
Organism:
Homo sapiens (Human)
Description:
Residue:
503
  
Inhibitor
Name:
BDBM50393265
Synonyms:
CHEMBL2152016
Type:
Small organic molecule
Emp. Form.:
C22H17N3O
Mol. Mass.:
339.3899
SMILES:
Cc1ccc(NC(=O)c2cc(nc3ccccc23)-c2ccncc2)cc1
: