Target
Glucagon-like peptide 1 receptor
Ligand
BDBM50393572
Substrate
Meas. Tech.
ChEMBL_855307 (CHEMBL2161791)
IC50
300±n/a nM
Citation
 Liu, QLi, NYuan, YLu, HWu, XZhou, CHe, MSu, HZhang, MWang, JWang, BWang, YMa, DYe, YWeiss, HCGesing, ERLiao, JWang, MW Cyclobutane derivatives as novel nonpeptidic small molecule agonists of glucagon-like peptide-1 receptor. J Med Chem 55:250-67 (2012)  
Target
Name:
Glucagon-like peptide 1 receptor
Synonyms:
GLP1R_RAT Glpr
Type:
PROTEIN
Mol. Mass.:
52889.73
Organism:
Rattus norvegicus
Description:
ChEMBL_855307
Residue:
463
  
Inhibitor
Name:
BDBM50393572
Synonyms:
CHEMBL2158488
Type:
Small organic molecule
Emp. Form.:
C52H48N4O14S2
Mol. Mass.:
1017.086
SMILES:
COc1cc(ccc1OC(=O)c1cccs1)[C@H]1[C@@](NC(=O)c2ccc(NC(=O)C(C)C)cc2)([C@@H](c2ccc(OC(=O)c3cccs3)c(OC)c2)[C@]1(NC(=O)c1ccc(NC(=O)C(C)C)cc1)C(O)=O)C(O)=O
: