Target
Heat shock protein HSP 90-beta
Ligand
BDBM50394059
Substrate
Meas. Tech.
ChEMBL_856085 (CHEMBL2162319)
Ki
3±n/a nM
Citation
 Davies, NGBrowne, HDavis, BDrysdale, MJFoloppe, NGeoffrey, SGibbons, BHart, THubbard, RJensen, MRMansell, HMassey, AMatassova, NMoore, JDMurray, JPratt, RRay, SRobertson, ARoughley, SDSchoepfer, JScriven, KSimmonite, HStokes, SSurgenor, AWebb, PWood, MWright, LBrough, P Targeting conserved water molecules: design of 4-aryl-5-cyanopyrrolo[2,3-d]pyrimidine Hsp90 inhibitors using fragment-based screening and structure-based optimization. Bioorg Med Chem 20:6770-89 (2012)  
Target
Name:
Heat shock protein HSP 90-beta
Synonyms:
HS90B_HUMAN HSP 90 HSP90B HSPCB Heat shock protein HSP 90 (Hsp90)
Type:
Molecular Chaperone
Mol. Mass.:
83229.45
Organism:
Homo sapiens (Human)
Description:
P08238
Residue:
724
  
Inhibitor
Name:
BDBM50394059
Synonyms:
CHEMBL2158569
Type:
Small organic molecule
Emp. Form.:
C19H18ClN5O3S
Mol. Mass.:
431.896
SMILES:
COc1cc(Cl)c(cc1O)-c1nc(SCC(=O)NC(C)C)nc2[nH]cc(C#N)c12
: