Target
Heat shock protein HSP 90-beta
Ligand
BDBM50394060
Substrate
Meas. Tech.
ChEMBL_856085 (CHEMBL2162319)
Ki
172±n/a nM
Citation
 Davies, NGBrowne, HDavis, BDrysdale, MJFoloppe, NGeoffrey, SGibbons, BHart, THubbard, RJensen, MRMansell, HMassey, AMatassova, NMoore, JDMurray, JPratt, RRay, SRobertson, ARoughley, SDSchoepfer, JScriven, KSimmonite, HStokes, SSurgenor, AWebb, PWood, MWright, LBrough, P Targeting conserved water molecules: design of 4-aryl-5-cyanopyrrolo[2,3-d]pyrimidine Hsp90 inhibitors using fragment-based screening and structure-based optimization. Bioorg Med Chem 20:6770-89 (2012)  
Target
Name:
Heat shock protein HSP 90-beta
Synonyms:
HS90B_HUMAN HSP 90 HSP90B HSPCB Heat shock protein HSP 90 (Hsp90)
Type:
Molecular Chaperone
Mol. Mass.:
83229.45
Organism:
Homo sapiens (Human)
Description:
P08238
Residue:
724
  
Inhibitor
Name:
BDBM50394060
Synonyms:
CHEMBL2158565
Type:
Small organic molecule
Emp. Form.:
C23H24ClF2N5O2S
Mol. Mass.:
507.984
SMILES:
COc1cc(Cl)c(cc1OCCN1CCC(F)(F)C1)-c1nc(SC(C)C)nc2[nH]cc(C#N)c12
: