Target
Fatty acid synthase
Ligand
BDBM50394661
Substrate
Meas. Tech.
ChEMBL_857778 (CHEMBL2169021)
IC50
15.8±n/a nM
Citation
 Abramson, HN The lipogenesis pathway as a cancer target. J Med Chem 54:5615-38 (2011)  
Target
Name:
Fatty acid synthase
Synonyms:
FAS FAS_HUMAN HU FASN
Type:
Enzyme
Mol. Mass.:
273419.37
Organism:
Homo sapiens (Human)
Description:
P49327
Residue:
2511
  
Inhibitor
Name:
BDBM50394661
Synonyms:
CHEMBL2165265
Type:
Small organic molecule
Emp. Form.:
C23H22N8O5S2
Mol. Mass.:
554.601
SMILES:
Cc1ccnc(NS(=O)(=O)c2ccc(NC(=O)Nc3ccc(cc3)S(=O)(=O)Nc3nccc(C)n3)cc2)n1
: