Target
Fatty acid synthase
Ligand
BDBM50394662
Substrate
Meas. Tech.
ChEMBL_857795 (CHEMBL2169038)
IC50
100000±n/a nM
Citation
 Abramson, HN The lipogenesis pathway as a cancer target. J Med Chem 54:5615-38 (2011)  
Target
Name:
Fatty acid synthase
Synonyms:
FAS FAS_HUMAN HU FASN
Type:
Enzyme
Mol. Mass.:
273419.37
Organism:
Homo sapiens (Human)
Description:
P49327
Residue:
2511
  
Inhibitor
Name:
BDBM50394662
Synonyms:
CHEMBL1093743
Type:
Small organic molecule
Emp. Form.:
C18H32O2
Mol. Mass.:
280.4455
SMILES:
CCCCC\C=C/C=C/CCCCCCCCC(O)=O
: