Target
Fatty acid synthase
Ligand
BDBM50394660
Substrate
Meas. Tech.
ChEMBL_857805 (CHEMBL2169238)
IC50
27000±n/a nM
Citation
 Abramson, HN The lipogenesis pathway as a cancer target. J Med Chem 54:5615-38 (2011)  
Target
Name:
Fatty acid synthase
Synonyms:
FAS FAS_CHICK | Fatty acid synthase (FAS)
Type:
Enzyme
Mol. Mass.:
274770.36
Organism:
Gallus gallus (Chicken)
Description:
P12276
Residue:
2512
  
Inhibitor
Name:
BDBM50394660
Synonyms:
CHEMBL2165409
Type:
Small organic molecule
Emp. Form.:
C57H97N17O19
Mol. Mass.:
1324.4826
SMILES:
[#6]-[#6]-[#6@H](-[#6])-[#6@H](-[#7]-[#6](=O)-[#6@@H](-[#7])-[#6]-[#6]-[#6](-[#8])=O)-[#6](=O)-[#7]-[#6@@H](-[#6@@H](-[#6])-[#8])-[#6](=O)-[#7]-1-[#6]-[#6]-[#6]-[#6@H]-1-[#6](=O)-[#7]-[#6@@H](-[#6]-[#6]-[#6](-[#8])=O)-[#6](=O)-[#7]-[#6@@H](-[#6]-[#6]-[#6]-[#6]-[#7])-[#6](=O)-[#7]-[#6@@H](-[#6]-[#6](-[#7])=O)-[#6](=O)-[#7]-1-[#6]-[#6]-[#6]-[#6@H]-1-[#6](=O)-[#7]-[#6@@H](-[#6]-[#6]-[#6](-[#7])=O)-[#6](=O)-[#7]-[#6@@H](-[#6]-[#6](-[#6])-[#6])-[#6](=O)-[#7]-[#6@@H](-[#6]-[#6]-[#6]\[#7]=[#6](/[#7])-[#7])-[#6](-[#8])=O
: