Target
Fatty acid synthase
Ligand
BDBM50070942
Substrate
Meas. Tech.
ChEMBL_857805 (CHEMBL2169238)
IC50
100000±n/a nM
Citation
 Abramson, HN The lipogenesis pathway as a cancer target. J Med Chem 54:5615-38 (2011)  
Target
Name:
Fatty acid synthase
Synonyms:
FAS FAS_CHICK | Fatty acid synthase (FAS)
Type:
Enzyme
Mol. Mass.:
274770.36
Organism:
Gallus gallus (Chicken)
Description:
P12276
Residue:
2512
  
Inhibitor
Name:
BDBM50070942
Synonyms:
(-)-Epigallocatechin gallate (-)-epigallocatechin 3-gallate CHEMBL297453 Epigallocatechin 3-gallate cid_65064
Type:
Small organic molecule
Emp. Form.:
C22H18O11
Mol. Mass.:
458.3717
SMILES:
Oc1cc(O)c2C[C@@H](OC(=O)c3cc(O)c(O)c(O)c3)[C@H](Oc2c1)c1cc(O)c(O)c(O)c1
: