Target
Fatty acid synthase
Ligand
BDBM50256128
Substrate
Meas. Tech.
ChEMBL_857805 (CHEMBL2169238)
IC50
80000±n/a nM
Citation
 Abramson, HN The lipogenesis pathway as a cancer target. J Med Chem 54:5615-38 (2011)  
Target
Name:
Fatty acid synthase
Synonyms:
FAS FAS_CHICK | Fatty acid synthase (FAS)
Type:
Enzyme
Mol. Mass.:
274770.36
Organism:
Gallus gallus (Chicken)
Description:
P12276
Residue:
2512
  
Inhibitor
Name:
BDBM50256128
Synonyms:
(2R,3S)-4-methylene-2-octyl-5-oxotetrahydrofuran-3-carboxylic acid CHEMBL449993
Type:
Small organic molecule
Emp. Form.:
C14H22O4
Mol. Mass.:
254.3221
SMILES:
CCCCCCCC[C@H]1OC(=O)C(=C)[C@@H]1C(O)=O
: